BDBM50175698 (4-(4-(benzo[b]thiophen-2-yl)pyrimidin-2-ylamino)-2-chlorophenyl)(4-(pyrrolidin-1-yl)piperidin-1-yl)methanone::CHEMBL199980
SMILES Clc1cc(Nc2nccc(n2)-c2cc3ccccc3s2)ccc1C(=O)N1CCC(CC1)N1CCCC1
InChI Key InChIKey=DCEAJJZHQFOWRL-UHFFFAOYSA-N
Data  3 IC50
  Tab Delimited (TSV)   2D SDfile   Computed 3D by Vconf -m prep SDfile
Find this compound or compounds like it in BindingDB:
Activity Spreadsheet -- Enzyme Inhibition Constant Data from BindingDB
Found 1 hit for monomerid = 50175698
TargetInhibitor of nuclear factor kappa-B kinase subunit beta(Homo sapiens (Human))
Novartis Institutes For Biomedical Research
Curated by ChEMBL
LigandPNGBDBM50175698((4-(4-(benzo[b]thiophen-2-yl)pyrimidin-2-ylamino)-...)
Affinity DataIC50:  90nM. Assay description: Inhibitory activity against IKK2
In DepthDetails ArticlePubMed